RDF description of レンタル・リース物件の資産額
primary topic: レンタル・リース物件の資産額

レンタル・リース物件の資産額
type: TerminologyConcept
in scheme: TerminologyConceptScheme
top concept of: TerminologyConceptScheme
broader: Ta00030
created: 2017-12-01
description: 耐用年数１年以上で取得価格が10万円以上のレンタル及びリース契約対象となる物件の購入に要した費用。