RDF description of 年間営業日数A
primary topic: 年間営業日数A

年間営業日数A
type: TerminologyConcept
in scheme: TerminologyConceptScheme
top concept of: TerminologyConceptScheme
broader: Ta00359
created: 2017-12-01
description: スポーツ・娯楽用品賃貸業務の調査日前１年間における事業所の営業日数。【平成21年11月変更】