商品貸出し数量
type: TerminologyConcept
description: スポーツ・娯楽用品賃貸業務に係る賃貸物件について、調査日前１年間に貸し出した数量（個数、セット数）。同じ賃貸物件を複数回貸し出している場合には、その総回数。
created: 2017-12-01
broader: Ta00468
top concept of: TerminologyConceptScheme
in scheme: TerminologyConceptScheme

RDF description of 商品貸出し数量
primary topic: 商品貸出し数量