商品保有数量
type: TerminologyConcept
description: スポーツ・娯楽用品賃貸業務に係る賃貸物件について、調査日現在で保有しているものの数量（個数、セット数）。
created: 2017-12-01
broader: Ta00468
top concept of: TerminologyConceptScheme
in scheme: TerminologyConceptScheme

RDF description of 商品保有数量
primary topic: 商品保有数量