賃貸物件の種類
type: TerminologyConcept
description: スポーツ・娯楽用品賃貸業務の賃貸業務を行っている主な物件。区分は、１．スキー、スノーボード ２．スケート ３．自転車 ４．ヨット、モーターボート ５．テント ６．その他の６種類。
created: 2017-12-01
broader: Ta00580
in scheme: TerminologyConceptScheme
top concept of: TerminologyConceptScheme

RDF description of 賃貸物件の種類
primary topic: 賃貸物件の種類