RDF description of 情報通信機器の資産額
primary topic: 情報通信機器の資産額

情報通信機器の資産額
type: TerminologyConcept
in scheme: TerminologyConceptScheme
top concept of: TerminologyConceptScheme
broader: Ta00030
created: 2017-12-01
description: 耐用年数１年以上で取得価格が１０万円以上の有線通信機器、無線通信機器、放送装置、自動交換装置、ファクシミリ、電子計算機、端末機器、補助装置、電子計算機附属装置、パソコン、ＣＡＤ／ＣＡＭ（コンピュータ設計・製造システム）などの購入に要した費用。