RDF description of 情報通信機器の賃借料額
primary topic: 情報通信機器の賃借料額

情報通信機器の賃借料額
type: TerminologyConcept
description: 有線通信機器、無線通信機器、放送装置、自動交換装置、ファクシミリ、電子計算機、端末機器、補助装置、電子計算機附属機器、パソコン、ＣＡＤ／ＣＡＭ（コンピュータ設計・製造システム）などの情報通信機器の賃借料。
created: 2017-12-01
broader: Ta00082
in scheme: TerminologyConceptScheme
top concept of: TerminologyConceptScheme