RDF description of 住宅の耐震診断の有無
primary topic: 住宅の耐震診断の有無

住宅の耐震診断の有無
type: TerminologyConcept
in scheme: TerminologyConceptScheme
top concept of: TerminologyConceptScheme
broader: Ta00568
created: 2017-12-01
description: 住宅の耐震診断の実施の有無（及び耐震性が確保されていたか否か）。耐震診断とは、建築事業者などの建築士に依頼して地震に対する安全性について調べることをいう。