RDF description of オートロックの別
primary topic: オートロックの別

オートロックの別
type: TerminologyConcept
in scheme: TerminologyConceptScheme
top concept of: TerminologyConceptScheme
broader: Ta00569
created: 2017-12-01
description: 共同住宅がオートロック式であるか否か。オートロック式の共同住宅とは、建物内に共用玄関のドアがあり、外からドアを開けるためには、鍵や暗証番号などを用いるか、居住者などに内側から鍵を解除してもらうことが必要であるものをいう。