腐朽・破損の有無
type: TerminologyConcept
description: 建物の腐朽・破損の有無。腐朽・破損のある建物とは、建物の主要部分やその他の部分に不具合があるものをいい、1 外壁がところどころ落ちている、2 壁や基礎の一部にひびが入っている、3 かわらが一部はずれている、4 雨どいが破損してひさしの一部が取れている場合などをいう。
created: 2017-12-01
broader: Ta00568
top concept of: TerminologyConceptScheme
in scheme: TerminologyConceptScheme

RDF description of 腐朽・破損の有無
primary topic: 腐朽・破損の有無