RDF description of 貯蓄の減少額
primary topic: 貯蓄の減少額

貯蓄の減少額
type: TerminologyConcept
description: 世帯員全員の当該年６月末日現在の貯蓄額を、前年６月末日の合計額と比べて減った場合の減少額。
created: 2017-12-01
broader: Ta00004
in scheme: TerminologyConceptScheme
top concept of: TerminologyConceptScheme