病気の予防等で医療機関に支払った費用の有無
type: TerminologyConcept
description: ５月中に病気の予防等で医療機関に支払った費用の有無。病気の予防等で医療機関に支払った費用には次のものを含む。１．人間ドックや健診（健康診断や健康診査）などの受診費用、２．予防接種（インフルエンザなど）の費用。次のような費用は含まない。１．正常な妊娠・分娩のために支払った費用、２．健康の保持・増進を目的としたスポーツクラブの入会金や利用料金など。
created: 2017-12-01
broader: Ta00566
top concept of: TerminologyConceptScheme
in scheme: TerminologyConceptScheme

RDF description of 病気の予防等で医療機関に支払った費用の有無
primary topic: 病気の予防等で医療機関に支払った費用の有無