臨時雇数Ａ
type: TerminologyConcept
description: ７か月未満の期間を定めて雇用されている者の数。【平成22年２月 定義内容の変更】
created: 2017-12-01
broader: Ta00116
in scheme: TerminologyConceptScheme
top concept of: TerminologyConceptScheme

RDF description of 臨時雇数Ａ
primary topic: 臨時雇数Ａ