勤め先・業主などの企業全体の常用雇用者数
type: TerminologyConcept
broader: Ta00116
narrower: si246020011
narrower: si246010011
description: 勤め先の企業（「経営組織」が官公の場合を除く。）に常時雇用されている者又は自分で経営している企業で常時雇用している者の数。常時雇用されて（して）いる者とは、期間を定めずに雇用されて（して）いる者又は１か月を超える期間を定めて雇用されて（して）いる者をいう。本社・本店・支店・出張所・工場などを含めた企業全体の常用雇用者数である。事業を営んでいる場合、業主自身、家族従業者及び家事使用人は除く。勤め先の企業とは、賃金・給与の支払を受けている企業である。特に、労働者派遣事業所の派遣社員の場合、派遣元の常用雇用者数である。
in scheme: TerminologyConceptScheme
narrower: si329020012
top concept of: TerminologyConceptScheme
narrower: si329010012
created: 2017-12-01

RDF description of 勤め先・業主などの企業全体の常用雇用者数
primary topic: 勤め先・業主などの企業全体の常用雇用者数