RDF description of 勤め先・業主などの企業全体の従業者数_2
primary topic: 勤め先・業主などの企業全体の従業者数_2

勤め先・業主などの企業全体の従業者数_2
type: TerminologyConcept
in scheme: TerminologyConceptScheme
top concept of: TerminologyConceptScheme
broader: Ta00116
created: 2017-12-01
description: 勤め先の企業又は自分で経営している企業の従業者の数。本社・本店・支店・出張所・工場などを含めた企業全体の従業者数である。ただし、勤め先の「経営組織」が官公（庁）の場合、官公（庁）となる。個人経営の商店や農家などの場合、業主自身及び家族従業者を含み、家事使用人は除く。勤め先の企業とは、賃金・給与の支払を受けている企業である。ただし、労働者派遣事業所の派遣社員の場合、派遣先の従業者数である。