過去の入院の有無
type: TerminologyConcept
description: 患者が今回入院する前に当該主傷病に関連した当該医療施設における過去の入院があったかどうかの有無。なお、この場合の過去の入院とは、その退院日が今回の入院年月日から遡って過去30日以内の場合かつ退院年が平成の場合である。ただし、転床による再入院は該当しない。一度、施設外へ退院してからの入院が対象となる。
created: 2017-12-01
broader: Ta00633
top concept of: TerminologyConceptScheme
in scheme: TerminologyConceptScheme

RDF description of 過去の入院の有無
primary topic: 過去の入院の有無