集荷（処理）量
type: TerminologyConcept
description: 生葉の集荷（処理）量。各茶期の終期に整枝・せん定をかねて刈り取った茶葉について、荒茶に加工（刈り番茶）される場合を含む。
created: 2017-12-01
broader: Ta00271
top concept of: TerminologyConceptScheme
in scheme: TerminologyConceptScheme

RDF description of 集荷（処理）量
primary topic: 集荷（処理）量