准教授数
type: TerminologyConcept
description: 高等教育機関（大学・短期大学・高等専門学校）において、学校教育法上の「准教授」として発令されている者の数。准教授とは、専攻分野について、教育上、研究上又は実務上の優れた知識、能力及び実績を有する者であって、学生を教授し、その研究を指導し、又は研究に従事する者である。
created: 2017-12-01
broader: Ta00122
top concept of: TerminologyConceptScheme
in scheme: TerminologyConceptScheme

RDF description of 准教授数
primary topic: 准教授数