RDF description of 現在の仕事又は前の仕事は最初の仕事か否か
primary topic: 現在の仕事又は前の仕事は最初の仕事か否か

現在の仕事又は前の仕事は最初の仕事か否か
type: TerminologyConcept
in scheme: TerminologyConceptScheme
top concept of: TerminologyConceptScheme
broader: Ta00532
created: 2017-12-01
description: 最初についた仕事は現在の仕事とも前の仕事とも別かどうか。通学のかたわらにしたアルバイトなどはここでいう「最初の仕事」には含めない。