訓練・自己啓発の種類
type: TerminologyConcept
description: 過去１年以内に行った仕事に役立てるための訓練や自己啓発の内容。「うち公的助成のあったもの」とは、国又は地方公共団体などの公的機関から助成を受けて、自発的に行ったものをいう。
created: 2017-12-01
broader: Ta00534
in scheme: TerminologyConceptScheme
top concept of: TerminologyConceptScheme

RDF description of 訓練・自己啓発の種類
primary topic: 訓練・自己啓発の種類