繰越利益剰余金の額
type: TerminologyConcept
description: 当期利益に、前期繰越利益及び任意積立金の目的取崩額を加算し、中間配当額及び中間配当に伴う利益準備金積立額を減算して算出した額。
created: 2017-12-01
broader: Ta00043
top concept of: TerminologyConceptScheme
in scheme: TerminologyConceptScheme

RDF description of 繰越利益剰余金の額
primary topic: 繰越利益剰余金の額