RDF description of 制度的な取組の実施状況
primary topic: 制度的な取組の実施状況

制度的な取組の実施状況
type: TerminologyConcept
in scheme: TerminologyConceptScheme
top concept of: TerminologyConceptScheme
broader: Ta00578
created: 2017-12-01
description: １．定年の引き上げ ２．再雇用制度の導入 ３．勤務延長制度の導入 ４．定年制度の廃止 ５．実施していない １～５につき選択（複数回答可）。