RDF description of 作付団地等の状況
primary topic: 作付団地等の状況

作付団地等の状況
type: TerminologyConcept
description: 作付けされた団地等の状況（作付面積、作付地域等）。団地とは、地続きの経営する耕地の一団をいう。
created: 2017-12-01
broader: Ta00648
in scheme: TerminologyConceptScheme
top concept of: TerminologyConceptScheme