月間総労働時間
type: TerminologyConcept
description: 時間内労働時間、時間外労働時間及び補償休日労働時間の合計。時間内労働時間とは、労働協約、就業規則等において定められた所定内労働時間である。時間外労働時間とは、時間内労働時間を超えて労働し、時間外手当の対象となった労働時間である。補償休日労働時間とは、補償休日において労働し、割増手当の対象となった労働時間である。補償休日とは、船員の労働時間（割増手当の規定の適用を受ける時間を除く。）が１週間において40時間を超える場合、又は船員に１週間において少なくとも１日の休日を与えることができない場合に、その超える時間において作業に従事すること又はその休日を与えられないことに対する補償として与えられる休日である。
created: 2017-12-01
broader: Ta00355
top concept of: TerminologyConceptScheme
in scheme: TerminologyConceptScheme

RDF description of 月間総労働時間
primary topic: 月間総労働時間