委員会設置会社か否かA
type: TerminologyConcept
description: 委員会設置会社とは、監査役を置かない代わりに、取締役の中に指名、監査、報酬の３委員会を置いている統治形態（コーポレート・ガバナンス）をいう。【平成28年12月 定義内容の変更。2014年6月に成立した会社法の改正法に伴い、「委員会設置会社制度」が「指名委員会等設置会社制度」に変更となったため。「指名委員会等設置会社か否か」に定義内容を変更】
created: 2017-12-01
broader: Ta00578
top concept of: TerminologyConceptScheme
in scheme: TerminologyConceptScheme

RDF description of 委員会設置会社か否かA
primary topic: 委員会設置会社か否かA