バイオテクノロジーの利用形態
type: TerminologyConcept
description: バイオテクノロジーに関連した事業内容（生産、販売、分析、検査、ソフト提供、研究、サービス等）があるかどうか。
created: 2017-12-01
broader: Ta00549
top concept of: TerminologyConceptScheme
in scheme: TerminologyConceptScheme

RDF description of バイオテクノロジーの利用形態
primary topic: バイオテクノロジーの利用形態