研究施設の所在地の国内・海外の別
type: TerminologyConcept
description: ２．グループ共同で研究施設（研究所）を持っているを選択した場合、国内か海外（両方選択可）を選択。
created: 2017-12-01
broader: Ta00578
in scheme: TerminologyConceptScheme
top concept of: TerminologyConceptScheme

RDF description of 研究施設の所在地の国内・海外の別
primary topic: 研究施設の所在地の国内・海外の別