RDF description of 研究施設の状況
primary topic: 研究施設の状況

研究施設の状況
type: TerminologyConcept
description: １．単体（単独）で研究施設（研究所）を持っている ２．グループ共同で研究施設（研究所）を持っている（１．国内 ２．海外） ３．研究施設（研究所）を持っていない １～３のうち、該当する番号を選択。単体及びグループ共同の両方の研究施設を持っている場合は、１．２．の両方を選択。
created: 2017-12-01
broader: Ta00578
in scheme: TerminologyConceptScheme
top concept of: TerminologyConceptScheme