新規所有企業数
type: TerminologyConcept
description: 子会社（５０％超の議決権所有、もしくは５０％以下であっても実質支配）で、新規設立又は新規保有の社数。 １．「新たに設立」とは、新規事業の創設等により新設されたもの。 ２．「分社化によるもの」とは、企業が事業又は組織の一部を分離し、別会社を設立した場合。 ３．「企業の買収によるもの」とは、５０％超の議決権を所有した場合。 ４．「その他（上記以外）」とは、１．、２．、３．以外の理由によって新設されたもの。
created: 2017-12-01
broader: Ta00379
in scheme: TerminologyConceptScheme
top concept of: TerminologyConceptScheme

RDF description of 新規所有企業数
primary topic: 新規所有企業数