RDF description of 手数料収入額
primary topic: 手数料収入額

手数料収入額
type: TerminologyConcept
in scheme: TerminologyConceptScheme
top concept of: TerminologyConceptScheme
broader: Ta00064
created: 2017-12-01
description: 自社のクレジットカード会員の販売信用取引（商品購入・サービスの利用）によって、受け取った手数料収入の総額。