企業の系統
type: TerminologyConcept
description: 企業の系統は、次の６つの区分による。１．銀行系（普通銀行、信託銀行、証券会社、生命保険会社、損害保険会社などの系列企業のうち、クレジットカード業務を営む企業） ２．信販会社（割賦販売法に基づき登録された割賦購入斡旋業者のうち、「銀行系」、「中小小売商団体」、「百貨店・量販店、流通系」、「その他」に該当する企業を除いたクレジットカード業務を営む企業） ３．中小小売商団体（専門店会、商店会などに加盟する団体で、クレジット カード業務を営む企業） ４．百貨店・量販店、流通系（百貨店、量販店（※）系列のクレジットカード会社及び、流通業者が自社又は自社の所属する企業グループの販売促進のため設立したクレジットカード会社） ５．割賦金融会社（割賦販売等に伴う販売店の債権を担保とし又は買い取 るなどにより、当該販売店に対して資金の供給を行う 業務を営む企業） ６．その他（上記以外でクレジットカード業務を営む企業）
created: 2017-12-01
broader: Ta00578
in scheme: TerminologyConceptScheme
top concept of: TerminologyConceptScheme

RDF description of 企業の系統
primary topic: 企業の系統