小売託送金額
type: TerminologyConcept
description: 年間契約使用量が熱量４６MJで１０万m3相当以上の大口需要家向けに小売り託送した金額。
created: 2017-12-01
broader: Ta00054
top concept of: TerminologyConceptScheme
in scheme: TerminologyConceptScheme

RDF description of 小売託送金額
primary topic: 小売託送金額