小売託送件数
type: TerminologyConcept
description: 託送供給とは、申告義務者が製品ガス需給に関して、申告義務者とは直接契約関係のない者へ申告義務者所有のガス導管により、他のガス供給事業を営む者からの製品ガスを供給することをいう。託送供給のうち年間契約使用量が熱量４６MJで１０万m3相当以上の大口需要家向けに託送した件数。
created: 2017-12-01
broader: Ta00405
top concept of: TerminologyConceptScheme
in scheme: TerminologyConceptScheme

RDF description of 小売託送件数
primary topic: 小売託送件数