RDF description of 健康上の問題で普段の生活ができなかった日数
primary topic: 健康上の問題で普段の生活ができなかった日数

健康上の問題で普段の生活ができなかった日数
type: TerminologyConcept
description: 過去１ヶ月間に、健康上の問題で床についたり、普段の活動ができなかった（仕事・学校を休んだ、家事ができなかった等）日があった場合の日数。
created: 2017-12-01
broader: Ta00361
in scheme: TerminologyConceptScheme
top concept of: TerminologyConceptScheme