病気やけが等で支払った費用の有無
type: TerminologyConcept
description: ５月中に病気やけがで支払った費用の有無。病気やけがで支払った費用には次のものを含む。１．病院や診療所などで支払った費用（医療保険の自己負担分、差額ベッド代などの保険適用外費用など、医師の診断によるあんま・はり・きゅう・柔道整復師（施術所）の治療）、２．保険薬局で支払った費用（病院・診療所から院外処方箋をもらい、調剤してもらった際に支払った費用）、３．市販の薬や包帯など（頭痛薬、胃薬、目薬など市販の薬、医師の診断によるめがねなどの購入、病気やけがなどが理由で購入（又は、レンタル）した医療用具、福祉用具、その他病気やけがなどが理由で前記１．や２．に該当しないもの。）次のような費用は含まない。１．正常な妊娠・分娩のために支払った費用、２．健康の保持・増進を目的としたスポーツクラブの入会金や利用料金など。
created: 2017-12-01
broader: Ta00566
top concept of: TerminologyConceptScheme
in scheme: TerminologyConceptScheme

RDF description of 病気やけが等で支払った費用の有無
primary topic: 病気やけが等で支払った費用の有無