RDF description of ホームページの掲載内容
primary topic: ホームページの掲載内容

ホームページの掲載内容
type: TerminologyConcept
description: 自施設で開設しているホームページ（複数施設で共同して開設または業者等に委託して開設しているホームページも含む。）に掲載している内容の状況。
created: 2017-12-01
broader: Ta00545
in scheme: TerminologyConceptScheme
top concept of: TerminologyConceptScheme