スパイラルCT検査実施件数
type: TerminologyConcept
description: Ｘ線照射管球の回転とテーブルの移動を同時に行うことで身体をらせん状にスキャンし、すべてのスライスを一度に撮影する検査の実施件数。
created: 2017-12-01
broader: Ta00403
top concept of: TerminologyConceptScheme
in scheme: TerminologyConceptScheme

RDF description of スパイラルCT検査実施件数
primary topic: スパイラルCT検査実施件数