RDF description of 患者のための相談窓口の有無
primary topic: 患者のための相談窓口の有無

患者のための相談窓口の有無
type: TerminologyConcept
in scheme: TerminologyConceptScheme
top concept of: TerminologyConceptScheme
broader: Ta00640
created: 2017-12-01
description: 当該病院内に患者相談窓口を常設し、患者等からの苦情、相談に応じられる体制の有無。