安全管理部門の有無
type: TerminologyConcept
description: 安全管理者、その他必要な職員で構成され、医療管理委員会で決定された方針に基づき、安全管理を担う部門の有無。
created: 2017-12-01
broader: Ta00639
top concept of: TerminologyConceptScheme
in scheme: TerminologyConceptScheme

RDF description of 安全管理部門の有無
primary topic: 安全管理部門の有無