仕事からの収入額_2
type: TerminologyConcept
description: 勤め先からの収入（勤め先から毎月支給される本給、扶養手当、役付手当、超過勤務手当、出来高歩合金、住宅手当、通勤手当などの給料・諸手当及び夏期、年末、年度末などに特別に支給される賞与やその他の臨時収入など。給与ベース改定差額、昇給差額、寒冷地手当などを含むが、定期券などを現物で支給された場合は含めない。）、自営業の収入（売上高から、仕入高、原材料費、人件費、消耗品費、事業税、固定資産税などの経営上の諸経費を差し引いたもの。）及び内職収入の額。おもな仕事からの収入に限定している。
created: 2017-12-01
broader: Ta00010
top concept of: TerminologyConceptScheme
in scheme: TerminologyConceptScheme

RDF description of 仕事からの収入額_2
primary topic: 仕事からの収入額_2