RDF description of 出荷長量
primary topic: 出荷長量

出荷長量
type: TerminologyConcept
in scheme: TerminologyConceptScheme
top concept of: TerminologyConceptScheme
broader: Ta00164
created: 2017-12-01
description: 出荷量を長さの単位（cm、m）で表したもの。出荷とは、工場及び工場が契約の主体となって借り受けている倉庫又は保管場所から、生産した製品又は受入品を、自社・他社分及び貸借関係を問わず、実際に出荷すること。