RDF description of 労働者の種類
primary topic: 労働者の種類

労働者の種類
type: TerminologyConcept
in scheme: TerminologyConceptScheme
top concept of: TerminologyConceptScheme
broader: Ta00530
created: 2017-12-01
description: 調査対象労働者を「生産労働者」と「管理・事務・技術労働者」に区分している。生産労働者とは、物の生産が行われる現場、建設作業の現場(補助部門を含む。)等における作業に従事する労働者。生産部門で労働するものであっても、事務員、技術員及び主として監督的業務に従事するものは、管理・事務・技術労働者に含めます。管理・事務・技術労働者とは、管理、経理、営業、人事、福利厚生、研究等の部門に働く労働者全部(単純作業に従事する者を含む。)及び生産部門にあって、これと同様な業務に従事する事務員、技術員及び作業に従事しない職長、組長等の監督的労働者。