労働時間
type: TerminologyConcept
description: 労働者が実際に労働した時間数。所定内労働時間だけでなく、所定外労働時間を含む。休憩時間は、給与が支給されるか否かにかかわらず除く。
created: 2017-12-01
broader: Ta00355
top concept of: TerminologyConceptScheme
in scheme: TerminologyConceptScheme

RDF description of 労働時間
primary topic: 労働時間