連続最大出力量
type: TerminologyConcept
description: 動力の最大定格出力量。内燃機関については制動馬力、蒸気機関については実馬力、蒸気タービンについては軸馬力のことである。
created: 2017-12-01
broader: Ta00321
top concept of: TerminologyConceptScheme
in scheme: TerminologyConceptScheme

RDF description of 連続最大出力量
primary topic: 連続最大出力量