冷凍・冷蔵庫の用途
type: TerminologyConcept
description: 冷凍・冷蔵庫の用途について「営業用」か「自家用」かの別。営業用とは、倉庫業法（昭和31年法律第121号）に基づき営業する事業所が、委託品を取り扱う場合をいいます。自家用とは、「営業用」以外のものをいう。
created: 2017-12-01
broader: Ta00543
top concept of: TerminologyConceptScheme
in scheme: TerminologyConceptScheme

RDF description of 冷凍・冷蔵庫の用途
primary topic: 冷凍・冷蔵庫の用途