臨床検査技師の常勤換算数
type: TerminologyConcept
description: 施設が直接雇い入れた者、派遣労働者、出向者、一般の従事者と同様の勤務状況にある家族従事者のうち、その施設で定めた１週間の勤務時間により常勤に換算した臨床検査技師の数。臨床検査技師とは、臨床検査技師の免許を有し、主として医師の指導監督の下に微生物学的検査、血清学的検査、血液学的検査、病理組織学的検査、原虫寄生虫学的検査、生化学的検査（臨床検査技師はこのほか政令で定める生理学的検査など）の業務に従事している者をいい、臨床検査技師の免許を有しないが、これらと同じ内容の業務の補助的業務に従事している者を除く。
created: 2017-12-01
broader: Ta00119
top concept of: TerminologyConceptScheme
in scheme: TerminologyConceptScheme

RDF description of 臨床検査技師の常勤換算数
primary topic: 臨床検査技師の常勤換算数