臨時従業者の実働延人員
type: TerminologyConcept
description: 臨時従業者（事業所、企業等に所属している従業者のうち、常用従業者ではない雇用者で、１か月以内の期間を定めて雇用されている者又は日々雇用されている者のうち、調査日前の２か月にそれぞれ18日以上雇用されている者を除いたものをいう。家族従業者で、臨時に業務に従事している者を含む。）について、実労働時間を１日の標準労働時間を１人として換算した延べ人員。
created: 2017-12-01
broader: Ta00124
top concept of: TerminologyConceptScheme
in scheme: TerminologyConceptScheme

RDF description of 臨時従業者の実働延人員
primary topic: 臨時従業者の実働延人員