臨時雇用者数_6
type: TerminologyConcept
description: 事業所、企業等に所属している従業者（他の会社など別経営の事業所へ派遣している者（労働者派遣法にいう派遣労働者）を含む。在籍出向など当該事業所に籍がありながら他の会社など別経営の事業所で働いている者は、当該事業所から一部でも給与が支払われている場合は含み、当該事業所から給与が支払われていない場合は除く。下請として当該事業所で請け負った仕事を請負先である他の会社など別経営の事業所で行っている者を含む。他の会社など別経営の事業所から派遣されている者（労働者派遣法にいう派遣労働者）は除く。在籍出向など、他の会社など別経営の事業所に籍がありながら当該事業所に来て働いている者は、別経営の事業所から一部でも給与が支払われている場合は除き、別経営の事業所から給与が支払われていない場合は含む。下請として他の会社など別経営の事業所で請け負った仕事を請負先である当該事業所に来て行っている者は除く。）のうち、常用雇用者以外の雇用者で、１か月未満の期間を定めて雇用されている者又は日々雇用されている者の数。
created: 2017-12-01
broader: Ta00116
in scheme: TerminologyConceptScheme
top concept of: TerminologyConceptScheme

RDF description of 臨時雇用者数_6
primary topic: 臨時雇用者数_6