臨時雇用者延人日
type: TerminologyConcept
description: 臨時雇用者（常時雇用者以外の雇用者で、特定の事業、作業に従事している１年未満の期間を定めて雇用されている者又は日々雇用されている者をいう。）について、実労働時間を８時間を１人として換算した延べ人日。
created: 2017-12-01
broader: Ta00124
in scheme: TerminologyConceptScheme
top concept of: TerminologyConceptScheme

RDF description of 臨時雇用者延人日
primary topic: 臨時雇用者延人日