臨時雇・日雇数
type: TerminologyConcept
description: 臨時雇（１か月以上１年未満の期間を定めて雇用されている者をいう。）及び日雇（１か月未満の期間を定めて雇用されている者又は日々雇用されている者をいう。）の数。
created: 2017-12-01
broader: Ta00116
top concept of: TerminologyConceptScheme
in scheme: TerminologyConceptScheme

RDF description of 臨時雇・日雇数
primary topic: 臨時雇・日雇数